Reaction Details
TargetPlasma kallikrein
LigandBDBM276767
Substrate/Competitorn/a
Meas. Tech.Plasma Kallikrein Assay
pH7.4±n/a
Temperature298.15±n/a K
IC50 0.940±n/a nM
Commentsextracted
Citation Röhrig, SJimenez Núnez, ESchlemmer, KTersteegen, ATeller, HHillisch, AHeitmeier, SSchmidt, MVStampfuß, J Substituted oxopyridine derivatives US Patent US10071995 Publication Date 9/11/2018
 
Plasma kallikrein
Name:Plasma kallikrein
Type:Protein
Mol. Mass.:71391.16
Organism:Homo sapiens (Human)
Description:P03952
Residue:638
BDBM276767
NameBDBM276767
Synonyms:US10071995, Example 1 | US10071995, Example 8
TypeSmall organic molecule
Emp. Form.C23H21ClN4O5S
Mol. Mass.500.955
SMILESCOCCC(C(=O)Nc1ccc(s1)C(N)=O)n1cc(OC)c(cc1=O)-c1cc(Cl)ccc1C#N