Reaction Details
TargetAlpha-1B adrenergic receptor
LigandBDBM50033111
Substrate/Competitorn/a
Ki 1.15±n/a nM
CommentsPDSP_1798
Citation Hancock, AABuckner, SABrune, MEEsbenshade, TAIreland, LMKatwala, SMilicic, IMeyer, MDKerwin, JFWilliams, M Preclinical pharmacology of fiduxosin, a novel alpha(1)-adrenoceptor antagonist with uroselective properties. J Pharmacol Exp Ther300:478-86 (2002) 
 
Alpha-1B adrenergic receptor
Name:Alpha-1B adrenergic receptor
Type:Enzyme
Mol. Mass.:56862.13
Organism:Homo sapiens (Human)
Description:P35368
Residue:520
BDBM50033111
NameBDBM50033111
Synonyms:1-(4-Amino-6,7-dimethoxy-2-quinazolinyl)-4-((tetrahydro-2-furanyl)carbonyl)piperazine CHEMBL611 Terazosine
TypeSmall organic molecule
Emp. Form.C19H25N5O4
Mol. Mass.387.4329
SMILESCOc1cc2nc(nc(N)c2cc1OC)N1CCN(CC1)C(=O)C1CCCO1