Reaction Details
TargetBeta-secretase 2
LigandBDBM276793
Substrate/Competitorn/a
Meas. Tech.BACE-2 Assay
pH5±n/a
Ki 0.240±n/a nM
Commentsextracted
Citation Wu, WHe, SWalsh, SPCumming, JN Iminothiadiazine dioxides bearing an amine-linked substituent as BACE inhibitors, compositions, and their use US Patent US10071998 Publication Date 9/11/2018
 
Beta-secretase 2
Name:Beta-secretase 2
Type:Protein
Mol. Mass.:56171.20
Organism:Homo sapiens (Human)
Description:Q9Y5Z0
Residue:518
BDBM276793
NameBDBM276793
Synonyms:3-fluoro-N-{4-fluoro-3-[(5R)-3-imino-2,5-dimethyl-1,1-dioxido-1,2,4-thiadiazinan-5-yl]phenyl}-1,7-naphthyridin-8-amine | US10071998, Example 8
TypeSmall organic molecule
Emp. Form.C19H18F2N6O2S
Mol. Mass.432.447
SMILESCN1C(=N)N[C@@](C)(CS1(=O)=O)c1cc(Nc2nccc3cc(F)cnc23)ccc1F