Reaction Details
TargetMelanin-concentrating hormone receptor 1
LigandBDBM85955
Substrate/Competitorn/a
Ki 11.3±n/a nM
CommentsPDSP_2480
Citation Bednarek, MAHreniuk, DLTan, CPalyha, OCMacNeil, DJVan der Ploeg, LHHoward, ADFeighner, SD Synthesis and biological evaluation in vitro of selective, high affinity peptide antagonists of human melanin-concentrating hormone action at human melanin-concentrating hormone receptor 1. Biochemistry41:6383-90 (2002) 
 
Melanin-concentrating hormone receptor 1
Name:Melanin-concentrating hormone receptor 1
Type:G Protein-Coupled Receptor (GPCR)
Mol. Mass.:45976.27
Organism:Homo sapiens (Human)
Description:Membranes from CHO-K1 cells stably expressing human MCH1R were used in assays.
Residue:422
BDBM85955
NameBDBM85955
Synonyms:D-Arg6,Ava14,15
TypeSmall organic molecule
Emp. Form.C52H87N17O12S3
Mol. Mass.1238.549
SMILES[#6]-[#16]-[#6]-[#6]-[#6]-1-[#7]-[#6](=O)-[#6@@H](-[#6]-[#16]-[#16]-[#6]-[#6](-[#7]-[#6](=O)-[#6]-[#6]-[#6]-[#6]-[#7]-[#6](=O)-[#6](-[#6]-c2ccc(-[#8])cc2)-[#7]-[#6](=O)-[#6](-[#7]-[#6](=O)-[#6](-[#6]-[#6]-[#6]\[#7]=[#6](\[#7])-[#7])-[#7]-[#6](=O)-[#6]-[#7]-[#6](=O)-[#6](-[#6]-[#6](-[#6])-[#6])-[#7]-[#6]-1=O)-[#6](-[#6])-[#6])-[#6](-[#7])=O)-[#7]-[#6](=O)-[#6](-[#6]-[#6]-[#6]\[#7]=[#6](\[#7])-[#7])-[#7]-[#6](-[#6])=O