Reaction Details
TargetCarboxylic ester hydrolase
LigandBDBM86006
Substrate/Competitorn/a
Meas. Tech.Enzyme Inhibition Assay
pH8±0
Temperature298.15±0 K
IC50 2.31e+4± 2.9e+3 nM
Citation Hasan, AKhan, KMSher, MMaharvi, GMNawaz, SAChoudhary, MIAtta-ur-Rahman, ASupuran, CT Synthesis and inhibitory potential towards acetylcholinesterase, butyrylcholinesterase and lipoxygenase of some variably substituted chalcones. J Enzyme Inhib Med Chem20:41-7 (2005) 
 
Carboxylic ester hydrolase
Name:Carboxylic ester hydrolase
Type:Protein
Mol. Mass.:68842.83
Organism:Equus caballus (Horse)
Description:Q9N1N9
Residue:602
BDBM86006
NameBDBM86006
Synonyms:Chalcone, 5
TypeSmall organic molecule
Emp. Form.C17H16O3
Mol. Mass.268.3071
SMILESCOc1ccc(\C=C\C(=O)c2ccccc2)cc1OC