Reaction Details
TargetBeta-1 adrenergic receptor
LigandBDBM50333880
Substrate/Competitorn/a
Ki 4406±n/a nM
CommentsPDSP_3173
Citation Butterweck, VNahrstedt, AEvans, JHufeisen, SRauser, LSavage, JPopadak, BErnsberger, PRoth, BL In vitro receptor screening of pure constituents of St. John's wort reveals novel interactions with a number of GPCRs. Psychopharmacology (Berl)162:193-202 (2002) 
 
Beta-1 adrenergic receptor
Name:Beta-1 adrenergic receptor
Type:Protein
Mol. Mass.:50486.84
Organism:Rattus norvegicus (Rat)
Description:P18090
Residue:466
BDBM50333880
NameBDBM50333880
Synonyms:CHEMBL1614664 Pseudohypericin
TypeSmall organic molecule
Emp. Form.C30H16O9
Mol. Mass.520.4426
SMILESCc1cc(O)c2c3c1c1c(CO)cc(O)c4c1c1c5c(c(O)cc(O)c5c4=O)c4c(O)cc(O)c(c4c31)c2=O