Reaction Details
TargetAlpha-1D adrenergic receptor
LigandBDBM22867
Substrate/Competitorn/a
Ki 2.95±n/a nM
CommentsPDSP_1079
Citation Millan, MJMaiofiss, LCussac, DAudinot, VBoutin, JANewman-Tancredi, A Differential actions of antiparkinson agents at multiple classes of monoaminergic receptor. I. A multivariate analysis of the binding profiles of 14 drugs at 21 native and cloned human receptor subtypes. J Pharmacol Exp Ther303:791-804 (2002) 
 
Alpha-1D adrenergic receptor
Name:Alpha-1D adrenergic receptor
Type:Enzyme Catalytic Domain
Mol. Mass.:60485.82
Organism:Homo sapiens (Human)
Description:adrenergic Alpha1D ADRA1D HUMAN::P25100
Residue:572
BDBM22867
NameBDBM22867
Synonyms:1,1-diethyl-3-[(8beta)-6-methyl-9,10-didehydroergolin-8-yl]urea 8R-lisuride | LISURIDE
TypeSmall organic molecule
Emp. Form.C20H26N4O
Mol. Mass.338.4466
SMILES[H][C@@]12Cc3c[nH]c4cccc(C1=C[C@H](CN2C)NC(=O)N(CC)CC)c34