Reaction Details
TargetAlpha-2B adrenergic receptor
LigandBDBM81993
Substrate/Competitorn/a
Ki 34.67±n/a nM
CommentsPDSP_423
Citation Millan, MJMaiofiss, LCussac, DAudinot, VBoutin, JANewman-Tancredi, A Differential actions of antiparkinson agents at multiple classes of monoaminergic receptor. I. A multivariate analysis of the binding profiles of 14 drugs at 21 native and cloned human receptor subtypes. J Pharmacol Exp Ther303:791-804 (2002) 
 
Alpha-2B adrenergic receptor
Name:Alpha-2B adrenergic receptor
Type:Enzyme
Mol. Mass.:49964.20
Organism:Homo sapiens (Human)
Description:P18089
Residue:450
BDBM81993
NameBDBM81993
Synonyms:BROMOCRIPTINE Bromocriptine+ (GTP-)
Typen/a
Emp. Form.C32H40BrN5O5
Mol. Mass.654.594
SMILESCC(C)C[C@@H]1N2C(=O)[C@](NC(=O)[C@H]3CN(C)[C@@H]4Cc5c(Br)[nH]c6cccc(C4=C3)c56)(O[C@@]2(O)[C@@H]2CCCN2C1=O)C(C)C