Reaction Details
TargetAlpha-2A adrenergic receptor [16-465]
LigandBDBM86053
Substrate/Competitorn/a
Ki 162.18±n/a nM
CommentsPDSP_1791
Citation Millan, MJMaiofiss, LCussac, DAudinot, VBoutin, JANewman-Tancredi, A Differential actions of antiparkinson agents at multiple classes of monoaminergic receptor. I. A multivariate analysis of the binding profiles of 14 drugs at 21 native and cloned human receptor subtypes. J Pharmacol Exp Ther303:791-804 (2002) 
 
Alpha-2A adrenergic receptor [16-465]
Name:Alpha-2A adrenergic receptor [16-465]
Type:G-protein coupled receptor
Mol. Mass.:48961.69
Organism:Rattus norvegicus (rat)
Description:P22909[16-465]
Residue:450
BDBM86053
NameBDBM86053
Synonyms:B-HT 920 CHEMBL279085 Talipexole | cid_5374
TypeSmall organic molecule
Emp. Form.C10H15N3S
Mol. Mass.209.311
SMILESNc1nc2CCN(CC=C)CCc2s1