Reaction Details
TargetD(2) dopamine receptor
LigandBDBM86052
Substrate/Competitorn/a
Ki 0.62±n/a nM
CommentsPDSP_3290
Citation Millan, MJMaiofiss, LCussac, DAudinot, VBoutin, JANewman-Tancredi, A Differential actions of antiparkinson agents at multiple classes of monoaminergic receptor. I. A multivariate analysis of the binding profiles of 14 drugs at 21 native and cloned human receptor subtypes. J Pharmacol Exp Ther303:791-804 (2002) 
 
D(2) dopamine receptor
Name:D(2) dopamine receptor
Type:Cell-surface receptors
Mol. Mass.:50647.10
Organism:Homo sapiens (Human)
Description:P14416
Residue:443
BDBM86052
NameBDBM86052
Synonyms:CAS_54746 NSC_54746
TypeSmall organic molecule
Emp. Form.C26H37N5O2
Mol. Mass.451.6043
SMILESCCNC(=O)N(CCCN(C)C)C(=O)C1CC2C(Cc3c[nH]c4cccc2c34)N(CC=C)C1