Reaction Details
TargetD(2) dopamine receptor
LigandBDBM50017519
Substrate/Competitorn/a
Ki 0.81±n/a nM
CommentsPDSP_1802
Citation Millan, MJMaiofiss, LCussac, DAudinot, VBoutin, JANewman-Tancredi, A Differential actions of antiparkinson agents at multiple classes of monoaminergic receptor. I. A multivariate analysis of the binding profiles of 14 drugs at 21 native and cloned human receptor subtypes. J Pharmacol Exp Ther303:791-804 (2002) 
 
D(2) dopamine receptor
Name:D(2) dopamine receptor
Type:Cell-surface receptors
Mol. Mass.:50647.10
Organism:Homo sapiens (Human)
Description:P14416
Residue:443
BDBM50017519
NameBDBM50017519
Synonyms:1,1-Diethyl-3-(7-methyl-4,6,6a,7,8,9,10,10a-octahydro-indolo[4,3-fg]quinolin-9-yl)-urea Terguride
TypeSmall organic molecule
Emp. Form.C20H28N4O
Mol. Mass.340.4625
SMILESCCN(CC)C(=O)N[C@H]1C[C@H]2[C@@H](Cc3c[nH]c4cccc2c34)N(C)C1