Reaction Details
TargetSodium-dependent dopamine transporter
LigandBDBM50010859
Substrate/Competitorn/a
Ki>10000±n/a nM
CommentsPDSP_973
Citation Bymaster, FPKatner, JSNelson, DLHemrick-Luecke, SKThrelkeld, PGHeiligenstein, JHMorin, SMGehlert, DRPerry, KW Atomoxetine increases extracellular levels of norepinephrine and dopamine in prefrontal cortex of rat: a potential mechanism for efficacy in attention deficit/hyperactivity disorder. Neuropsychopharmacology27:699-711 (2002) 
 
Sodium-dependent dopamine transporter
Name:Sodium-dependent dopamine transporter
Type:Multi-pass membrane protein
Mol. Mass.:68497.11
Organism:Homo sapiens (Human)
Description:Q01959
Residue:620
BDBM50010859
NameBDBM50010859
Synonyms:CHEMBL11 IMIPRAMINE PAMOATE | Imipramin
TypeSmall organic molecule
Emp. Form.C19H24N2
Mol. Mass.280.4073
SMILESCN(C)CCCN1c2ccccc2CCc2ccccc12