Reaction Details
TargetGlutamate receptor 3
LigandBDBM50022784
Substrate/Competitorn/a
Ki 1000±n/a nM
CommentsPDSP_3689
Citation Bymaster, FPKatner, JSNelson, DLHemrick-Luecke, SKThrelkeld, PGHeiligenstein, JHMorin, SMGehlert, DRPerry, KW Atomoxetine increases extracellular levels of norepinephrine and dopamine in prefrontal cortex of rat: a potential mechanism for efficacy in attention deficit/hyperactivity disorder. Neuropsychopharmacology27:699-711 (2002) 
 
Glutamate receptor 3
Name:Glutamate receptor 3
Type:Enzyme Catalytic Domain
Mol. Mass.:100383.57
Organism:RAT
Description:Glutamate-AMPA GRIA3 RAT::P19492
Residue:888
BDBM50022784
NameBDBM50022784
Synonyms:(R)-N-methyl-3-phenyl-3-(o-tolyloxy)propan-1-amine CHEMBL641 Methyl-(3-phenyl-3-o-tolyloxy-propyl)-amine Strattera | Tomoxetine
TypeSmall organic molecule
Emp. Form.C17H21NO
Mol. Mass.255.3547
SMILESCNCCC(Oc1ccccc1C)c1ccccc1