Reaction Details
TargetPhosphatidylinositol 3,4,5-trisphosphate 5-phosphatase 2
LigandBDBM50022784
Substrate/Competitorn/a
Ki 1000±n/a nM
CommentsPDSP_3689
Citation Bymaster, FPKatner, JSNelson, DLHemrick-Luecke, SKThrelkeld, PGHeiligenstein, JHMorin, SMGehlert, DRPerry, KW Atomoxetine increases extracellular levels of norepinephrine and dopamine in prefrontal cortex of rat: a potential mechanism for efficacy in attention deficit/hyperactivity disorder. Neuropsychopharmacology27:699-711 (2002) 
 
Phosphatidylinositol 3,4,5-trisphosphate 5-phosphatase 2
Name:Phosphatidylinositol 3,4,5-trisphosphate 5-phosphatase 2
Type:Enzyme Catalytic Domain
Mol. Mass.:139139.35
Organism:RAT
Description:Inositol Triphosphate 0 RAT::Q9WVR3
Residue:1257
BDBM50022784
NameBDBM50022784
Synonyms:(R)-N-methyl-3-phenyl-3-(o-tolyloxy)propan-1-amine CHEMBL641 Methyl-(3-phenyl-3-o-tolyloxy-propyl)-amine Strattera | Tomoxetine
TypeSmall organic molecule
Emp. Form.C17H21NO
Mol. Mass.255.3547
SMILESCNCCC(Oc1ccccc1C)c1ccccc1