Reaction Details
TargetSodium-dependent noradrenaline transporter
LigandBDBM50022784
Substrate/Competitorn/a
Ki 5±n/a nM
CommentsPDSP_3689
Citation Bymaster, FPKatner, JSNelson, DLHemrick-Luecke, SKThrelkeld, PGHeiligenstein, JHMorin, SMGehlert, DRPerry, KW Atomoxetine increases extracellular levels of norepinephrine and dopamine in prefrontal cortex of rat: a potential mechanism for efficacy in attention deficit/hyperactivity disorder. Neuropsychopharmacology27:699-711 (2002) 
 
Sodium-dependent noradrenaline transporter
Name:Sodium-dependent noradrenaline transporter
Type:Multi-pass membrane protein
Mol. Mass.:69337.72
Organism:Homo sapiens (Human)
Description:P23975
Residue:617
BDBM50022784
NameBDBM50022784
Synonyms:(R)-N-methyl-3-phenyl-3-(o-tolyloxy)propan-1-amine CHEMBL641 Methyl-(3-phenyl-3-o-tolyloxy-propyl)-amine Strattera | Tomoxetine
TypeSmall organic molecule
Emp. Form.C17H21NO
Mol. Mass.255.3547
SMILESCNCCC(Oc1ccccc1C)c1ccccc1