Reaction Details
TargetType-1 angiotensin II receptor A
LigandBDBM50287290
Substrate/Competitorn/a
Ki 1.02±n/a nM
CommentsPDSP_3385
Citation Inada, YNakane, TChiba, S Binding of KRH-594, an antagonist of the angiotensin II type 1 receptor, to cloned human and rat angiotensin II receptors. Fundam Clin Pharmacol16:317-23 (2002) 
 
Type-1 angiotensin II receptor A
Name:Type-1 angiotensin II receptor A
Type:Enzyme Catalytic Domain
Mol. Mass.:40910.53
Organism:RAT
Description:ANGIOTENSIN AT1 AGTR1 RAT::P25095
Residue:359
BDBM50287290
NameBDBM50287290
Synonyms:CHEMBL34866 Potassium; 2-[5-ethyl-3-[2'-(1H-tetrazol-5-yl)-biphenyl-4-ylmethyl]-3H-[1,3,4]thiadiazol-(2Z)-ylidenecarbamoyl]-cyclopent-1-enecarboxylate
TypeSmall organic molecule
Emp. Form.C25H22N7O3S
Mol. Mass.500.553
SMILESCCc1nn(Cc2ccc(cc2)-c2ccccc2-c2nnn[nH]2)c(=NC(=O)C2=C(CCC2)C([O-])=O)s1