Reaction Details
TargetSodium-dependent serotonin transporter
LigandBDBM86199
Substrate/Competitorn/a
Ki>10000±n/a nM
CommentsPDSP_2980
Citation Shi, QSavage, JEHufeisen, SJRauser, LGrajkowska, EErnsberger, PWroblewski, JTNadeau, JHRoth, BL L-homocysteine sulfinic acid and other acidic homocysteine derivatives are potent and selective metabotropic glutamate receptor agonists. J Pharmacol Exp Ther305:131-42 (2003) 
 
Sodium-dependent serotonin transporter
Name:Sodium-dependent serotonin transporter
Type:Multi-pass membrane protein
Mol. Mass.:70322.51
Organism:Homo sapiens (Human)
Description:P31645
Residue:630
BDBM86199
NameBDBM86199
Synonyms:CAS_595 D-cystine NSC_595 | NSC_67678
TypeSmall organic molecule
Emp. Form.C6H12N2O4S2
Mol. Mass.240.3
SMILESNC(CSSCC(N)C(O)=O)C(O)=O