Reaction Details
Target5-hydroxytryptamine receptor 2A
LigandBDBM86199
Substrate/Competitorn/a
Ki>10000±n/a nM
CommentsPDSP_2968
Citation Shi, QSavage, JEHufeisen, SJRauser, LGrajkowska, EErnsberger, PWroblewski, JTNadeau, JHRoth, BL L-homocysteine sulfinic acid and other acidic homocysteine derivatives are potent and selective metabotropic glutamate receptor agonists. J Pharmacol Exp Ther305:131-42 (2003) 
 
5-hydroxytryptamine receptor 2A
Name:5-hydroxytryptamine receptor 2A
Type:G Protein-Coupled Receptor (GPCR)
Mol. Mass.:52852.05
Organism:Rattus norvegicus (rat)
Description:Rat cortex membranes 5-HT2A receptors.
Residue:471
BDBM86199
NameBDBM86199
Synonyms:CAS_595 D-cystine NSC_595 | NSC_67678
TypeSmall organic molecule
Emp. Form.C6H12N2O4S2
Mol. Mass.240.3
SMILESNC(CSSCC(N)C(O)=O)C(O)=O