Reaction Details
Target5-hydroxytryptamine receptor 2A
LigandBDBM86196
Substrate/Competitorn/a
Ki>10000±n/a nM
CommentsPDSP_2978
Citation Shi, QSavage, JEHufeisen, SJRauser, LGrajkowska, EErnsberger, PWroblewski, JTNadeau, JHRoth, BL L-homocysteine sulfinic acid and other acidic homocysteine derivatives are potent and selective metabotropic glutamate receptor agonists. J Pharmacol Exp Ther305:131-42 (2003) 
 
5-hydroxytryptamine receptor 2A
Name:5-hydroxytryptamine receptor 2A
Type:G Protein-Coupled Receptor (GPCR)
Mol. Mass.:52852.05
Organism:Rattus norvegicus (rat)
Description:Rat cortex membranes 5-HT2A receptors.
Residue:471
BDBM86196
NameBDBM86196
Synonyms:D-homocysteic acid
TypeSmall organic molecule
Emp. Form.C4H9NO5S
Mol. Mass.183.183
SMILESN[C@H](CCS(O)(=O)=O)C(O)=O