Reaction Details
TargetAlpha-1A adrenergic receptor
LigandBDBM86196
Substrate/Competitorn/a
Ki>10000±n/a nM
CommentsPDSP_2978
Citation Shi, QSavage, JEHufeisen, SJRauser, LGrajkowska, EErnsberger, PWroblewski, JTNadeau, JHRoth, BL L-homocysteine sulfinic acid and other acidic homocysteine derivatives are potent and selective metabotropic glutamate receptor agonists. J Pharmacol Exp Ther305:131-42 (2003) 
 
Alpha-1A adrenergic receptor
Name:Alpha-1A adrenergic receptor
Type:Cell-surface receptors
Mol. Mass.:51511.67
Organism:Homo sapiens (Human)
Description:P35348
Residue:466
BDBM86196
NameBDBM86196
Synonyms:D-homocysteic acid
TypeSmall organic molecule
Emp. Form.C4H9NO5S
Mol. Mass.183.183
SMILESN[C@H](CCS(O)(=O)=O)C(O)=O