Reaction Details
TargetNeuronal acetylcholine receptor subunit alpha-3
LigandBDBM86199
Substrate/Competitorn/a
Ki>10000±n/a nM
CommentsPDSP_2968
Citation Shi, QSavage, JEHufeisen, SJRauser, LGrajkowska, EErnsberger, PWroblewski, JTNadeau, JHRoth, BL L-homocysteine sulfinic acid and other acidic homocysteine derivatives are potent and selective metabotropic glutamate receptor agonists. J Pharmacol Exp Ther305:131-42 (2003) 
 
Neuronal acetylcholine receptor subunit alpha-3
Name:Neuronal acetylcholine receptor subunit alpha-3
Type:Enzyme Catalytic Domain
Mol. Mass.:57479.03
Organism:Homo sapiens (Human)
Description:Cholinergic, Nicotinic Alpha3Beta2 0 HUMAN::P32297
Residue:505
BDBM86199
NameBDBM86199
Synonyms:CAS_595 D-cystine NSC_595 | NSC_67678
TypeSmall organic molecule
Emp. Form.C6H12N2O4S2
Mol. Mass.240.3
SMILESNC(CSSCC(N)C(O)=O)C(O)=O