Reaction Details
TargetNeuronal acetylcholine receptor subunit alpha-3
LigandBDBM86197
Substrate/Competitorn/a
Ki>10000±n/a nM
CommentsPDSP_2975
Citation Shi, QSavage, JEHufeisen, SJRauser, LGrajkowska, EErnsberger, PWroblewski, JTNadeau, JHRoth, BL L-homocysteine sulfinic acid and other acidic homocysteine derivatives are potent and selective metabotropic glutamate receptor agonists. J Pharmacol Exp Ther305:131-42 (2003) 
 
Neuronal acetylcholine receptor subunit alpha-3
Name:Neuronal acetylcholine receptor subunit alpha-3
Type:Enzyme Catalytic Domain
Mol. Mass.:57479.03
Organism:Homo sapiens (Human)
Description:Cholinergic, Nicotinic Alpha3Beta2 0 HUMAN::P32297
Residue:505
BDBM86197
NameBDBM86197
Synonyms:D-homocysteine sulfinic acid
TypeSmall organic molecule
Emp. Form.C4H9NO4S
Mol. Mass.167.184
SMILESN[C@H](CCS(O)=O)C(O)=O