Reaction Details
TargetNeuronal acetylcholine receptor subunit alpha-3
LigandBDBM85473
Substrate/Competitorn/a
Ki>10000±n/a nM
CommentsPDSP_2979
Citation Shi, QSavage, JEHufeisen, SJRauser, LGrajkowska, EErnsberger, PWroblewski, JTNadeau, JHRoth, BL L-homocysteine sulfinic acid and other acidic homocysteine derivatives are potent and selective metabotropic glutamate receptor agonists. J Pharmacol Exp Ther305:131-42 (2003) 
 
Neuronal acetylcholine receptor subunit alpha-3
Name:Neuronal acetylcholine receptor subunit alpha-3
Type:Enzyme Catalytic Domain
Mol. Mass.:57479.03
Organism:Homo sapiens (Human)
Description:Cholinergic, Nicotinic Alpha3Beta2 0 HUMAN::P32297
Residue:505
BDBM85473
NameBDBM85473
Synonyms:L-Cysteic acid, 8 | L-cysteic acid
TypeSmall organic molecule
Emp. Form.C3H7NO5S
Mol. Mass.169.156
SMILESNC(CS(O)(=O)=O)C(O)=O