Reaction Details
TargetNeuronal acetylcholine receptor subunit alpha-3
LigandBDBM50220147
Substrate/Competitorn/a
Ki>10000±n/a nM
CommentsPDSP_2967
Citation Shi, QSavage, JEHufeisen, SJRauser, LGrajkowska, EErnsberger, PWroblewski, JTNadeau, JHRoth, BL L-homocysteine sulfinic acid and other acidic homocysteine derivatives are potent and selective metabotropic glutamate receptor agonists. J Pharmacol Exp Ther305:131-42 (2003) 
 
Neuronal acetylcholine receptor subunit alpha-3
Name:Neuronal acetylcholine receptor subunit alpha-3
Type:Enzyme Catalytic Domain
Mol. Mass.:57479.03
Organism:Homo sapiens (Human)
Description:Cholinergic, Nicotinic Alpha3Beta2 0 HUMAN::P32297
Residue:505
BDBM50220147
NameBDBM50220147
Synonyms:(S)-2-amino-4-sulfobutanoic acid L-2-amino-4-sulfobutyric acid L-homocysteic acid
TypeSmall organic molecule
Emp. Form.C4H9NO5S
Mol. Mass.183.183
SMILESN[C@@H](CCS(O)(=O)=O)C(O)=O