Reaction Details
TargetHistamine H1 receptor
LigandBDBM86196
Substrate/Competitorn/a
Ki>10000±n/a nM
CommentsPDSP_2978
Citation Shi, QSavage, JEHufeisen, SJRauser, LGrajkowska, EErnsberger, PWroblewski, JTNadeau, JHRoth, BL L-homocysteine sulfinic acid and other acidic homocysteine derivatives are potent and selective metabotropic glutamate receptor agonists. J Pharmacol Exp Ther305:131-42 (2003) 
 
Histamine H1 receptor
Name:Histamine H1 receptor
Type:G Protein-Coupled Receptor (GPCR)
Mol. Mass.:55808.72
Organism:Homo sapiens (Human)
Description:Cell pellets from SK-N-MC cells transfected with human H1 receptor were used in binding assay.
Residue:487
BDBM86196
NameBDBM86196
Synonyms:D-homocysteic acid
TypeSmall organic molecule
Emp. Form.C4H9NO5S
Mol. Mass.183.183
SMILESN[C@H](CCS(O)(=O)=O)C(O)=O