Reaction Details
TargetMu-type opioid receptor
LigandBDBM86196
Substrate/Competitorn/a
Ki>10000±n/a nM
CommentsPDSP_2978
Citation Shi, QSavage, JEHufeisen, SJRauser, LGrajkowska, EErnsberger, PWroblewski, JTNadeau, JHRoth, BL L-homocysteine sulfinic acid and other acidic homocysteine derivatives are potent and selective metabotropic glutamate receptor agonists. J Pharmacol Exp Ther305:131-42 (2003) 
 
Mu-type opioid receptor
Name:Mu-type opioid receptor
Type:G Protein-Coupled Receptor (GPCR)
Mol. Mass.:44789.51
Organism:Homo sapiens (Human)
Description:P35372
Residue:400
BDBM86196
NameBDBM86196
Synonyms:D-homocysteic acid
TypeSmall organic molecule
Emp. Form.C4H9NO5S
Mol. Mass.183.183
SMILESN[C@H](CCS(O)(=O)=O)C(O)=O