Reaction Details
TargetVasopressin V1b receptor
LigandBDBM50326713
Substrate/Competitorn/a
Ki>10000±n/a nM
CommentsPDSP_6852
Citation Cirillo, RGillio Tos, ESchwarz, MKQuattropani, AScheer, AMissotten, MDorbais, JNichols, ABorrelli, FGiachetti, CGolzio, LMarinelli, PThomas, RJChevillard, CLaurent, FPortet, KBarberis, CChollet, A Pharmacology of (2S,4Z)-N-[(2S)-2-hydroxy-2-phenylethyl]-4-(methoxyimino) -1-[(2'-methyl[1,1'-biphenyl]-4-yl)carbonyl]-2-pyrrolidinecarboxamide, a new potent and selective nonpeptide antagonist of the oxytocin receptor. J Pharmacol Exp Ther306:253-61 (2003) 
 
Vasopressin V1b receptor
Name:Vasopressin V1b receptor
Type:Enzyme
Mol. Mass.:46985.01
Organism:Homo sapiens (Human)
Description:P47901
Residue:424
BDBM50326713
NameBDBM50326713
Synonyms:(2S,4Z)-N-[(2S)-2-hydroxy-2-phenylethyl]-4-(methoxyimino)-1-[(2'-methyl[1,1'-biphenyl]-4-yl)carbonyl]-2-pyrrolidinecarboxamide CHEMBL1254024
TypeSmall organic molecule
Emp. Form.C28H29N3O4
Mol. Mass.471.5476
SMILESCO\N=C1\C[C@H](N(C1)C(=O)c1ccc(cc1)-c1ccccc1C)C(=O)NC[C@@H](O)c1ccccc1