Reaction Details
TargetUncharacterized protein
LigandBDBM86241
Substrate/Competitorn/a
Ki 201±n/a nM
CommentsPDSP_666
Citation Vailati, SMoretti, MLonghi, RRovati, GEClementi, FGotti, C Developmental expression of heteromeric nicotinic receptor subtypes in chick retina. Mol Pharmacol63:1329-37 (2003) 
 
Uncharacterized protein
Name:Uncharacterized protein
Synonyms:Cholinergic, Nicotinic Alpha6Beta4
Type:Enzyme Catalytic Domain
Mol. Mass.:55323.77
Organism:Chick
Description:Cholinergic, Nicotinic Alpha6Beta4 0 Chick::F6Z813
Residue:486
BDBM86241
NameBDBM86241
TypeSmall organic molecule
Emp. Form.C16H21NO3
Mol. Mass.275.3428
SMILESCOC1CC=C2CCN3CCC4=C(CC(=O)OC4)C23C1