Reaction Details
TargetKappa-type opioid receptor
LigandBDBM21130
Substrate/Competitorn/a
Ki 443±n/a nM
CommentsPDSP_1936
Citation Spetea, MTóth, FSchütz, JOtvös, FTóth, GBenyhe, SBorsodi, ASchmidhammer, H Binding characteristics of [3H]14-methoxymetopon, a high affinity mu-opioid receptor agonist. Eur J Neurosci18:290-5 (2003) 
 
Kappa-type opioid receptor
Name:Kappa-type opioid receptor
Type:G Protein-Coupled Receptor (GPCR)
Mol. Mass.:42692.90
Organism:Rattus norvegicus (rat)
Description:P34975
Residue:380
BDBM21130
NameBDBM21130
Synonyms:N-methyl-2-phenyl-N-[(5R,7S,8S)-7-(pyrrolidin-1-yl)-1-oxaspiro[4.5]decan-8-yl]acetamide U-69593 [3H]U69593
Typeradiolabeled ligand
Emp. Form.C22H32N2O2
Mol. Mass.356.5017
SMILESCN([C@H]1CC[C@@]2(CCCO2)C[C@@H]1N1CCCC1)C(=O)Cc1ccccc1