Reaction Details
TargetMu-type opioid receptor
LigandBDBM86261
Substrate/Competitorn/a
Ki 0.48±n/a nM
CommentsPDSP_3383
Citation Spetea, MTóth, FSchütz, JOtvös, FTóth, GBenyhe, SBorsodi, ASchmidhammer, H Binding characteristics of [3H]14-methoxymetopon, a high affinity mu-opioid receptor agonist. Eur J Neurosci18:290-5 (2003) 
 
Mu-type opioid receptor
Name:Mu-type opioid receptor
Type:G Protein-Coupled Receptor (GPCR)
Mol. Mass.:44503.11
Organism:Rattus norvegicus (rat)
Description:Competition binding assays were carried out using membrane preparations from transfected HN9.10 cells that constitutively expressed the mu opioid receptor.
Residue:398
BDBM86261
NameBDBM86261
Synonyms:14-methoxymetopon NSC_125489
TypeSmall organic molecule
Emp. Form.C19H23NO4
Mol. Mass.329.3902
SMILESCOC12CCC(=O)C3(C)Oc4c5c(CC1N(C)CCC235)ccc4O