Reaction Details
TargetMu-type opioid receptor
LigandBDBM86258
Substrate/Competitorn/a
Ki 6.55±n/a nM
CommentsPDSP_1250
Citation Spetea, MTóth, FSchütz, JOtvös, FTóth, GBenyhe, SBorsodi, ASchmidhammer, H Binding characteristics of [3H]14-methoxymetopon, a high affinity mu-opioid receptor agonist. Eur J Neurosci18:290-5 (2003) 
 
Mu-type opioid receptor
Name:Mu-type opioid receptor
Type:G Protein-Coupled Receptor (GPCR)
Mol. Mass.:44503.11
Organism:Rattus norvegicus (rat)
Description:Competition binding assays were carried out using membrane preparations from transfected HN9.10 cells that constitutively expressed the mu opioid receptor.
Residue:398
BDBM86258
NameBDBM86258
Synonyms:CAS_23552-18-3 NSC_5980
TypeSmall organic molecule
Emp. Form.C17H19NO3
Mol. Mass.285.3377
SMILESCN1CCC23C4Oc5c2c(CC1C3C=CC4O)ccc5O