Reaction Details
TargetDelta-type opioid receptor
LigandBDBM85731
Substrate/Competitorn/a
Ki 1670±n/a nM
CommentsPDSP_3254
Citation Zhao, GMQian, XSchiller, PWSzeto, HH Comparison of [Dmt1]DALDA and DAMGO in binding and G protein activation at mu, delta, and kappa opioid receptors. J Pharmacol Exp Ther307:947-54 (2003) 
 
Delta-type opioid receptor
Name:Delta-type opioid receptor
Type:G Protein-Coupled Receptor (GPCR)
Mol. Mass.:40382.98
Organism:Homo sapiens (Human)
Description:Competition binding assays were carried out using membrane preparations from transfected HN9.10 cells that constitutively expressed the delta opioid receptor.
Residue:372
BDBM85731
NameBDBM85731
Synonyms:[Dmt1]DALDA
TypeSmall organic molecule
Emp. Form.C32H49N9O5
Mol. Mass.639.7888
SMILES[#6]-c1cc(-[#8])cc(-[#6])c1-[#6]-[#6@H](-[#7])-[#6](=O)-[#7]-[#6@H](-[#6]-[#6]-[#6]\[#7]=[#6](\[#7])-[#7])-[#6](=O)-[#7]-[#6@@H](-[#6]-c1ccccc1)-[#6](=O)-[#7]-[#6@@H](-[#6]-[#6]-[#6]-[#6]-[#7])-[#6](-[#7])=O