Reaction Details
TargetMu-type opioid receptor
LigandBDBM86419
Substrate/Competitorn/a
Ki 1.69±n/a nM
CommentsPDSP_3253
Citation Zhao, GMQian, XSchiller, PWSzeto, HH Comparison of [Dmt1]DALDA and DAMGO in binding and G protein activation at mu, delta, and kappa opioid receptors. J Pharmacol Exp Ther307:947-54 (2003) 
 
Mu-type opioid receptor
Name:Mu-type opioid receptor
Type:Enzyme Catalytic Domain
Mol. Mass.:44431.62
Organism:MOUSE
Description:OPIATE Mu OPRM1 MOUSE::P42866
Residue:398
BDBM86419
NameBDBM86419
Synonyms:CAS_122222 NSC_122222
TypeSmall organic molecule
Emp. Form.C30H45N9O5
Mol. Mass.611.7356
SMILES[#7]-[#6]-[#6]-[#6]-[#6]-[#6](-[#7]-[#6](=O)-[#6](-[#6]-c1ccccc1)-[#7]-[#6](=O)-[#6](-[#6]-[#6]-[#6]\[#7]=[#6](\[#7])-[#7])-[#7]-[#6](=O)-[#6](-[#7])-[#6]-c1ccc(-[#8])cc1)-[#6](-[#7])=O