Reaction Details
TargetMu-type opioid receptor
LigandBDBM86253
Substrate/Competitorn/a
Ki 2.83±n/a nM
CommentsPDSP_616
Citation Zhao, GMQian, XSchiller, PWSzeto, HH Comparison of [Dmt1]DALDA and DAMGO in binding and G protein activation at mu, delta, and kappa opioid receptors. J Pharmacol Exp Ther307:947-54 (2003) 
 
Mu-type opioid receptor
Name:Mu-type opioid receptor
Type:Enzyme Catalytic Domain
Mol. Mass.:44431.62
Organism:MOUSE
Description:OPIATE Mu OPRM1 MOUSE::P42866
Residue:398
BDBM86253
NameBDBM86253
Synonyms:CAS_100929-53-1 NSC_104742 | US10836728, Compound DAMGO
TypeSmall organic molecule
Emp. Form.C26H35N5O6
Mol. Mass.513.586
SMILESCC(NC(=O)C(N)Cc1ccc(O)cc1)C(=O)NCC(=O)N(C)C(Cc1ccccc1)C(=O)NCCO