Reaction Details
TargetMu-type opioid receptor
LigandBDBM86416
Substrate/Competitorn/a
Ki 0.0636±n/a nM
CommentsPDSP_3268
Citation Zhao, GMQian, XSchiller, PWSzeto, HH Comparison of [Dmt1]DALDA and DAMGO in binding and G protein activation at mu, delta, and kappa opioid receptors. J Pharmacol Exp Ther307:947-54 (2003) 
 
Mu-type opioid receptor
Name:Mu-type opioid receptor
Type:Enzyme Catalytic Domain
Mol. Mass.:44431.62
Organism:MOUSE
Description:OPIATE Mu OPRM1 MOUSE::P42866
Residue:398
BDBM86416
NameBDBM86416
Synonyms:Dmt-d-Arg-Phe-A2pr-NH2
TypeSmall organic molecule
Emp. Form.C29H43N9O5
Mol. Mass.597.709
SMILES[#6]-c1cc(-[#8])cc(-[#6])c1-[#6]-[#6@H](-[#7])-[#6](=O)-[#7]-[#6@H](-[#6]-[#6]-[#6]\[#7]=[#6](\[#7])-[#7])-[#6](=O)-[#7]-[#6@@H](-[#6]-c1ccccc1)-[#6](=O)-[#7]-[#6@@H](-[#6]-[#7])-[#6](-[#7])=O