Reaction Details
TargetMu-type opioid receptor
LigandBDBM86258
Substrate/Competitorn/a
Ki 1±n/a nM
CommentsPDSP_1250
Citation Zhao, GMQian, XSchiller, PWSzeto, HH Comparison of [Dmt1]DALDA and DAMGO in binding and G protein activation at mu, delta, and kappa opioid receptors. J Pharmacol Exp Ther307:947-54 (2003) 
 
Mu-type opioid receptor
Name:Mu-type opioid receptor
Type:Enzyme Catalytic Domain
Mol. Mass.:44431.62
Organism:MOUSE
Description:OPIATE Mu OPRM1 MOUSE::P42866
Residue:398
BDBM86258
NameBDBM86258
Synonyms:CAS_23552-18-3 NSC_5980
TypeSmall organic molecule
Emp. Form.C17H19NO3
Mol. Mass.285.3377
SMILESCN1CCC23C4Oc5c2c(CC1C3C=CC4O)ccc5O