Reaction Details
TargetMu-type opioid receptor
LigandBDBM50060070
Substrate/Competitorn/a
Ki 1.53±n/a nM
CommentsPDSP_3263
Citation Zhao, GMQian, XSchiller, PWSzeto, HH Comparison of [Dmt1]DALDA and DAMGO in binding and G protein activation at mu, delta, and kappa opioid receptors. J Pharmacol Exp Ther307:947-54 (2003) 
 
Mu-type opioid receptor
Name:Mu-type opioid receptor
Type:Enzyme Catalytic Domain
Mol. Mass.:44431.62
Organism:MOUSE
Description:OPIATE Mu OPRM1 MOUSE::P42866
Residue:398
BDBM50060070
NameBDBM50060070
Synonyms:(S)-2-Amino-N-{(R)-1-[(S)-1-((S)-1-carbamoyl-2-phenyl-ethylcarbamoyl)-2-phenyl-ethylcarbamoyl]-ethyl}-3-(4-hydroxy-phenyl)-propionamide CHEMBL317264 | Tyr-d-Ala-Phe-Phe-NH2
TypeSmall organic molecule
Emp. Form.C30H35N5O5
Mol. Mass.545.6294
SMILESC[C@@H](NC(=O)[C@@H](N)Cc1ccc(O)cc1)C(=O)N[C@@H](Cc1ccccc1)C(=O)N[C@@H](Cc1ccccc1)C(N)=O