Reaction Details
TargetMu-type opioid receptor
LigandBDBM85731
Substrate/Competitorn/a
Ki 0.143±n/a nM
CommentsPDSP_3254
Citation Zhao, GMQian, XSchiller, PWSzeto, HH Comparison of [Dmt1]DALDA and DAMGO in binding and G protein activation at mu, delta, and kappa opioid receptors. J Pharmacol Exp Ther307:947-54 (2003) 
 
Mu-type opioid receptor
Name:Mu-type opioid receptor
Type:Enzyme Catalytic Domain
Mol. Mass.:44431.62
Organism:MOUSE
Description:OPIATE Mu OPRM1 MOUSE::P42866
Residue:398
BDBM85731
NameBDBM85731
Synonyms:[Dmt1]DALDA
TypeSmall organic molecule
Emp. Form.C32H49N9O5
Mol. Mass.639.7888
SMILES[#6]-c1cc(-[#8])cc(-[#6])c1-[#6]-[#6@H](-[#7])-[#6](=O)-[#7]-[#6@H](-[#6]-[#6]-[#6]\[#7]=[#6](\[#7])-[#7])-[#6](=O)-[#7]-[#6@@H](-[#6]-c1ccccc1)-[#6](=O)-[#7]-[#6@@H](-[#6]-[#6]-[#6]-[#6]-[#7])-[#6](-[#7])=O