Reaction Details
TargetKappa-type opioid receptor
LigandBDBM86448
Substrate/Competitorn/a
Ki 43.2±n/a nM
CommentsPDSP_4495
Citation Spetea, MFriedmann, TRiba, PSchütz, JWunder, GLanger, TSchmidhammer, HFürst, S In vitro opioid activity profiles of 6-amino acid substituted derivatives of 14-O-methyloxymorphone. Eur J Pharmacol483:301-8 (2004) 
 
Kappa-type opioid receptor
Name:Kappa-type opioid receptor
Type:G Protein-Coupled Receptor (GPCR)
Mol. Mass.:42692.90
Organism:Rattus norvegicus (rat)
Description:P34975
Residue:380
BDBM86448
NameBDBM86448
Synonyms:2-[(4,5alpha-epoxy-3-hydroxy-14beta-methoxy-17-methylmorphinan-6alpha-yl)amino]acetic acid bis(tetrafluoroborate)
TypeSmall organic molecule
Emp. Form.C20H26N2O5
Mol. Mass.374.4308
SMILESCOC12CC[C@H](NCC(O)=O)[C@@H]3Oc4c5c(CC1N(C)CC[C@@]235)ccc4O