Reaction Details
TargetAlpha-2B adrenergic receptor
LigandBDBM50171290
Substrate/Competitorn/a
Ki 1000±n/a nM
CommentsPDSP_3734
Citation Rinaldi-Carmona, MBarth, FCongy, CMartinez, SOustric, DPério, APoncelet, MMaruani, JArnone, MFinance, OSoubrié, PLe Fur, G SR147778 [5-(4-bromophenyl)-1-(2,4-dichlorophenyl)-4-ethyl-N-(1-piperidinyl)-1H-pyrazole-3-carboxamide], a new potent and selective antagonist of the CB1 cannabinoid receptor: biochemical and pharmacological characterization. J Pharmacol Exp Ther310:905-14 (2004) 
 
Alpha-2B adrenergic receptor
Name:Alpha-2B adrenergic receptor
Type:Enzyme
Mol. Mass.:49964.20
Organism:Homo sapiens (Human)
Description:P18089
Residue:450
BDBM50171290
NameBDBM50171290
Synonyms:5-(4-Bromo-phenyl)-1-(2,4-dichloro-phenyl)-4-ethyl-1H-pyrazole-3-carboxylic acid piperidin-1-ylamide SR 147778
TypeSmall organic molecule
Emp. Form.C23H23BrCl2N4O
Mol. Mass.522.265
SMILESCCc1c(nn(c1-c1ccc(Br)cc1)-c1ccc(Cl)cc1Cl)C(=O)NN1CCCCC1