Reaction Details
TargetDelta-type opioid receptor
LigandBDBM86546
Substrate/Competitorn/a
Ki 3.4±n/a nM
CommentsPDSP_740
Citation Wang, YTang, KInan, SSiebert, DHolzgrabe, ULee, DYHuang, PLi, JGCowan, ALiu-Chen, LY Comparison of pharmacological activities of three distinct kappa ligands (Salvinorin A, TRK-820 and 3FLB) on kappa opioid receptors in vitro and their antipruritic and antinociceptive activities in vivo. J Pharmacol Exp Ther312:220-30 (2005) 
 
Delta-type opioid receptor
Name:Delta-type opioid receptor
Type:Enzyme Catalytic Domain
Mol. Mass.:40577.25
Organism:MOUSE
Description:P32300
Residue:372
BDBM86546
NameBDBM86546
Synonyms:CAS_88373-73-3 NSC_104787
TypeSmall organic molecule
Emp. Form.C30H39N5O7S2
Mol. Mass.645.79
SMILESCC1(C)SSC(C)(C)C(NC(=O)C(N)Cc2ccc(O)cc2)C(=O)NCC(=O)NC(Cc2ccccc2)C(=O)NC1C(O)=O