Reaction Details
TargetDelta-type opioid receptor
LigandBDBM86549
Substrate/Competitorn/a
Ki 289±n/a nM
CommentsPDSP_3759
Citation Wang, YTang, KInan, SSiebert, DHolzgrabe, ULee, DYHuang, PLi, JGCowan, ALiu-Chen, LY Comparison of pharmacological activities of three distinct kappa ligands (Salvinorin A, TRK-820 and 3FLB) on kappa opioid receptors in vitro and their antipruritic and antinociceptive activities in vivo. J Pharmacol Exp Ther312:220-30 (2005) 
 
Delta-type opioid receptor
Name:Delta-type opioid receptor
Type:Enzyme Catalytic Domain
Mol. Mass.:40577.25
Organism:MOUSE
Description:P32300
Residue:372
BDBM86549
NameBDBM86549
Synonyms:CAS_213055 TRK-820
TypeSmall organic molecule
Emp. Form.C28H32N2O5
Mol. Mass.476.5641
SMILESCN(C1CCC2(O)C3Cc4ccc(O)c5OC1C2(CCN3CC1CC1)c45)C(=O)C=Cc1ccoc1