Reaction Details
TargetAurora kinase A
LigandBDBM81552
Substrate/Competitorn/a
Meas. Tech.In Vitro Kinase Assay
IC50 5.6±0.0 nM
Citation Kwiatkowski, NDeng, XWang, JTan, LVilla, FSantaguida, SHuang, HCMitchison, TMusacchio, AGray, N Selective aurora kinase inhibitors identified using a taxol-induced checkpoint sensitivity screen. ACS Chem Biol7:185-96 (2012) 
 
Aurora kinase A
Name:Aurora kinase A
Type:Serine/threonine-protein kinase
Mol. Mass.:45830.98
Organism:Homo sapiens (Human)
Description:O14965
Residue:403
BDBM81552
NameBDBM81552
Synonyms:Benzo[e]pyrimido[5,4-b][1,4]diazepin-6(11H)-one, 1 | Scaffold, B54
TypeSmall organic molecule
Emp. Form.C24H26N6O2
Mol. Mass.430.5022
SMILESCN1c2ccccc2C(=O)N(C)c2cnc(Nc3ccc(cc3)N3CCC(O)CC3)nc12