Reaction Details
TargetAurora kinase A
LigandBDBM86599
Substrate/Competitorn/a
Meas. Tech.In Vitro Kinase Assay
IC50 8.8±0.0 nM
Citation Kwiatkowski, NDeng, XWang, JTan, LVilla, FSantaguida, SHuang, HCMitchison, TMusacchio, AGray, N Selective aurora kinase inhibitors identified using a taxol-induced checkpoint sensitivity screen. ACS Chem Biol7:185-96 (2012) 
 
Aurora kinase A
Name:Aurora kinase A
Type:Serine/threonine-protein kinase
Mol. Mass.:45830.98
Organism:Homo sapiens (Human)
Description:O14965
Residue:403
BDBM86599
NameBDBM86599
Synonyms:Benzo[e]pyrimido[5,4-b][1,4]diazepin-6(11H)-one, 4
TypeSmall organic molecule
Emp. Form.C24H26N6O4S
Mol. Mass.494.566
SMILESCN1c2ccccc2C(=O)N(C)c2cnc(Nc3ccc(cc3)S(=O)(=O)N3CCC(O)CC3)nc12