Reaction Details
TargetAurora kinase A
LigandBDBM50337135
Substrate/Competitorn/a
Meas. Tech.In Vitro Kinase Assay
IC50 3.4±0.0 nM
Citation Kwiatkowski, NDeng, XWang, JTan, LVilla, FSantaguida, SHuang, HCMitchison, TMusacchio, AGray, N Selective aurora kinase inhibitors identified using a taxol-induced checkpoint sensitivity screen. ACS Chem Biol7:185-96 (2012) 
 
Aurora kinase A
Name:Aurora kinase A
Type:Serine/threonine-protein kinase
Mol. Mass.:45830.98
Organism:Homo sapiens (Human)
Description:O14965
Residue:403
BDBM50337135
NameBDBM50337135
Synonyms:4-((5,11-dimethyl-6-oxo-6,11-dihydro-5H-benzo[e]pyrimido[5,4-b][1,4]diazepin-2-yl)amino)benzenesulfonamide CHEMBL1673047 | US11155556, No. 16
TypeSmall organic molecule
Emp. Form.C19H18N6O3S
Mol. Mass.410.45
SMILESCN1c2ccccc2C(=O)N(C)c2cnc(Nc3ccc(cc3)S(N)(=O)=O)nc12