Reaction Details
TargetAurora kinase A
LigandBDBM86603
Substrate/Competitorn/a
Meas. Tech.In Vitro Kinase Assay
IC50 323±0.0 nM
Citation Kwiatkowski, NDeng, XWang, JTan, LVilla, FSantaguida, SHuang, HCMitchison, TMusacchio, AGray, N Selective aurora kinase inhibitors identified using a taxol-induced checkpoint sensitivity screen. ACS Chem Biol7:185-96 (2012) 
 
Aurora kinase A
Name:Aurora kinase A
Type:Serine/threonine-protein kinase
Mol. Mass.:45830.98
Organism:Homo sapiens (Human)
Description:O14965
Residue:403
BDBM86603
NameBDBM86603
Synonyms:Benzo[e]pyrimido[5,4-b][1,4]diazepin-6(11H)-one, 10
TypeSmall organic molecule
Emp. Form.C26H22FN5O2
Mol. Mass.455.4836
SMILESCN1c2ccccc2C(=O)N(C)c2cnc(Nc3ccc(OCc4cccc(F)c4)cc3)nc12