Reaction Details
TargetAurora kinase A
LigandBDBM86620
Substrate/Competitorn/a
Meas. Tech.In Vitro Kinase Assay
IC50 457±0.0 nM
Citation Kwiatkowski, NDeng, XWang, JTan, LVilla, FSantaguida, SHuang, HCMitchison, TMusacchio, AGray, N Selective aurora kinase inhibitors identified using a taxol-induced checkpoint sensitivity screen. ACS Chem Biol7:185-96 (2012) 
 
Aurora kinase A
Name:Aurora kinase A
Type:Serine/threonine-protein kinase
Mol. Mass.:45830.98
Organism:Homo sapiens (Human)
Description:O14965
Residue:403
BDBM86620
NameBDBM86620
Synonyms:Benzo[e]pyrimido[5,4-b][1,4]diazepin-6(11H)-one, 26
TypeSmall organic molecule
Emp. Form.C26H27F3N6O2
Mol. Mass.512.5268
SMILESCCN1CCN(Cc2ccc(Nc3ncc4N(C)C(=O)c5ccccc5Oc4n3)cc2C(F)(F)F)CC1