Reaction Details
TargetAurora kinase B
LigandBDBM86606
Substrate/Competitorn/a
Meas. Tech.In Vitro Kinase Assay
IC50 84.8±0.0 nM
Citation Kwiatkowski, NDeng, XWang, JTan, LVilla, FSantaguida, SHuang, HCMitchison, TMusacchio, AGray, N Selective aurora kinase inhibitors identified using a taxol-induced checkpoint sensitivity screen. ACS Chem Biol7:185-96 (2012) 
 
Aurora kinase B
Name:Aurora kinase B
Type:Protein
Mol. Mass.:39327.72
Organism:Homo sapiens (Human)
Description:Q96GD4
Residue:344
BDBM86606
NameBDBM86606
Synonyms:Benzo[e]pyrimido[5,4-b][1,4]diazepin-6(11H)-one, 12
TypeSmall organic molecule
Emp. Form.C26H26F3N7O2
Mol. Mass.525.5255
SMILESCN1CCN(CC1)C(=O)c1ccc(Nc2ncc3N(C)C(=O)c4ccccc4N(C)c3n2)cc1C(F)(F)F