Reaction Details
TargetAurora kinase B
LigandBDBM86616
Substrate/Competitorn/a
Meas. Tech.In Vitro Kinase Assay
IC50 24.2±0.0 nM
Citation Kwiatkowski, NDeng, XWang, JTan, LVilla, FSantaguida, SHuang, HCMitchison, TMusacchio, AGray, N Selective aurora kinase inhibitors identified using a taxol-induced checkpoint sensitivity screen. ACS Chem Biol7:185-96 (2012) 
 
Aurora kinase B
Name:Aurora kinase B
Type:Protein
Mol. Mass.:39327.72
Organism:Homo sapiens (Human)
Description:Q96GD4
Residue:344
BDBM86616
NameBDBM86616
Synonyms:Benzo[e]pyrimido[5,4-b][1,4]diazepin-6(11H)-one, 22
TypeSmall organic molecule
Emp. Form.C25H27N7O4
Mol. Mass.489.5264
SMILESCOc1cc(Nc2ncc3N(C)C(=O)c4ccccc4N(C)c3n2)ccc1C(=O)N1CCN(O)CC1