Reaction Details
TargetDelta-type opioid receptor
LigandBDBM50299565
Substrate/Competitorn/a
Ki 13.13±n/a nM
CommentsPDSP_4764
Citation Tryoen-Tóth, PDécaillot, FMFilliol, DBefort, KLazarus, LHSchiller, PWSchmidhammer, HKieffer, BL Inverse agonism and neutral antagonism at wild-type and constitutively active mutant delta opioid receptors. J Pharmacol Exp Ther313:410-21 (2005) 
 
Delta-type opioid receptor
Name:Delta-type opioid receptor
Type:G Protein-Coupled Receptor (GPCR)
Mol. Mass.:40382.98
Organism:Homo sapiens (Human)
Description:Competition binding assays were carried out using membrane preparations from transfected HN9.10 cells that constitutively expressed the delta opioid receptor.
Residue:372
BDBM50299565
NameBDBM50299565
Synonyms:(S)-2-((S)-2-amino-3-(4-hydroxy-2,6-dimethylphenyl)propanoyl)-1,2,3,4-tetrahydroisoquinoline-3-carboxylic acid H-2',6'-dimethyltyrosine-Tic-OH | H-Dmt-Tic-OH
TypeSmall organic molecule
Emp. Form.C21H24N2O4
Mol. Mass.368.4263
SMILESCc1cc(O)cc(C)c1C[C@H](N)C(=O)N1Cc2ccccc2C[C@H]1C(O)=O